Reaction Details
TargetDNA damage-inducible transcript 3 protein
LigandBDBM39024
Substrate/Competitorn/a
Meas. Tech.Dose-response primary assay and counterscreen assay for HTS small molecule inhibitors of CHOP to regulate the unfolded protein response to ER stress
IC50<160±n/a nM
Citation PubChem, PC Dose-response primary assay and counterscreen assay for HTS small molecule inhibitors of CHOP to regulate the unfolded protein response to ER stress PubChem Bioassay(2010)[AID]
 
DNA damage-inducible transcript 3 protein
Name:DNA damage-inducible transcript 3 protein
Type:Enzyme Catalytic Domain
Mol. Mass.:19175.17
Organism:Mus musculus
Description:gi_160707929
Residue:168
BDBM39024
NameBDBM39024
Synonyms:3-[(2-chloro-4-methylol-phenoxy)methyl]benzoic acid 3-[[2-chloro-4-(hydroxymethyl)phenoxy]methyl]benzoic acid MLS000099276 cid_893460
TypeSmall organic molecule
Emp. Form.C15H13ClO4
Mol. Mass.292.714
SMILESOCc1ccc(OCc2cccc(c2)C(O)=O)c(Cl)c1