Reaction Details
TargetDNA damage-inducible transcript 3 protein
LigandBDBM68010
Substrate/Competitorn/a
Meas. Tech.Dose-response primary assay and counterscreen assay for HTS small molecule inhibitors of CHOP to regulate the unfolded protein response to ER stress
IC50<160±n/a nM
Citation PubChem, PC Dose-response primary assay and counterscreen assay for HTS small molecule inhibitors of CHOP to regulate the unfolded protein response to ER stress PubChem Bioassay(2010)[AID]
 
DNA damage-inducible transcript 3 protein
Name:DNA damage-inducible transcript 3 protein
Type:Enzyme Catalytic Domain
Mol. Mass.:19175.17
Organism:Mus musculus
Description:gi_160707929
Residue:168
BDBM68010
NameBDBM68010
Synonyms:(2Z,6E)-4-tert-butyl-2,6-bis(2-furanylmethylidene)-1-cyclohexanone (2Z,6E)-4-tert-butyl-2,6-bis(2-furylmethylene)cyclohexanone MLS000580624 cid_12004979
TypeSmall organic molecule
Emp. Form.C20H22O3
Mol. Mass.310.3869
SMILESCC(C)(C)C1C\C(=C\c2ccco2)C(=O)\C(C1)=C\c1ccco1