Reaction Details
TargetDNA damage-inducible transcript 3 protein
LigandBDBM64626
Substrate/Competitorn/a
Meas. Tech.Dose-response primary assay and counterscreen assay for HTS small molecule inhibitors of CHOP to regulate the unfolded protein response to ER stress
IC50<160±n/a nM
Citation PubChem, PC Dose-response primary assay and counterscreen assay for HTS small molecule inhibitors of CHOP to regulate the unfolded protein response to ER stress PubChem Bioassay(2010)[AID]
 
DNA damage-inducible transcript 3 protein
Name:DNA damage-inducible transcript 3 protein
Type:Enzyme Catalytic Domain
Mol. Mass.:19175.17
Organism:Mus musculus
Description:gi_160707929
Residue:168
BDBM64626
NameBDBM64626
Synonyms:2-Chloro-N-[2,2,2-trifluoro-1-(6-nitro-benzothiazol-2-ylamino)-1-trifluoromethyl-ethyl]-benzamide 2-chloro-N-[1,1,1,3,3,3-hexafluoro-2-[(6-nitro-1,3-benzothiazol-2-yl)amino]propan-2-yl]benzamide MLS000592113 cid_1716838
TypeSmall organic molecule
Emp. Form.C17H9ClF6N4O3S
Mol. Mass.498.787
SMILES[O-][N+](=O)c1ccc2nc(NC(NC(=O)c3ccccc3Cl)(C(F)(F)F)C(F)(F)F)sc2c1