Reaction Details
TargetDNA damage-inducible transcript 3 protein
LigandBDBM63568
Substrate/Competitorn/a
Meas. Tech.Dose-response primary assay and counterscreen assay for HTS small molecule inhibitors of CHOP to regulate the unfolded protein response to ER stress
IC50<160±n/a nM
Citation PubChem, PC Dose-response primary assay and counterscreen assay for HTS small molecule inhibitors of CHOP to regulate the unfolded protein response to ER stress PubChem Bioassay(2010)[AID]
 
DNA damage-inducible transcript 3 protein
Name:DNA damage-inducible transcript 3 protein
Type:Enzyme Catalytic Domain
Mol. Mass.:19175.17
Organism:Mus musculus
Description:gi_160707929
Residue:168
BDBM63568
NameBDBM63568
Synonyms:2-({[2-(4-ethylphenyl)-5-methyl-1,3-oxazol-4-yl]methyl}thio)-N-(2-furylmethyl)acetamide 2-[[2-(4-ethylphenyl)-5-methyl-1,3-oxazol-4-yl]methylsulfanyl]-N-(furan-2-ylmethyl)ethanamide 2-[[2-(4-ethylphenyl)-5-methyl-oxazol-4-yl]methylthio]-N-(2-furfuryl)acetamide SMR000309382 | cid_16193680
TypeSmall organic molecule
Emp. Form.C20H22N2O3S
Mol. Mass.370.465
SMILESCCc1ccc(cc1)-c1nc(CSCC(=O)NCc2ccco2)c(C)o1