Reaction Details
TargetDNA damage-inducible transcript 3 protein
LigandBDBM68139
Substrate/Competitorn/a
Meas. Tech.Dose-response primary assay and counterscreen assay for HTS small molecule inhibitors of CHOP to regulate the unfolded protein response to ER stress
IC50 260±n/a nM
Citation PubChem, PC Dose-response primary assay and counterscreen assay for HTS small molecule inhibitors of CHOP to regulate the unfolded protein response to ER stress PubChem Bioassay(2010)[AID]
 
DNA damage-inducible transcript 3 protein
Name:DNA damage-inducible transcript 3 protein
Type:Enzyme Catalytic Domain
Mol. Mass.:19175.17
Organism:Mus musculus
Description:gi_160707929
Residue:168
BDBM68139
NameBDBM68139
Synonyms:MLS000621996 N-[3-[4-(2-fluorophenyl)piperazin-1-yl]propyl]-2-[2-[(2-sulfanylidene-1H-quinazolin-4-yl)amino]-1,3-thiazol-4-yl]acetamide N-[3-[4-(2-fluorophenyl)piperazino]propyl]-2-[2-[(2-thioxo-1H-quinazolin-4-yl)amino]thiazol-4-yl]acetamide SMR000310923 | cid_16195306
TypeSmall organic molecule
Emp. Form.C26H28FN7OS2
Mol. Mass.537.675
SMILESFc1ccccc1N1CCN(CCCNC(=O)Cc2csc(Nc3[nH]c(=S)nc4ccccc34)n2)CC1