Reaction Details
TargetDNA damage-inducible transcript 3 protein
LigandBDBM61626
Substrate/Competitorn/a
Meas. Tech.Dose-response primary assay and counterscreen assay for HTS small molecule inhibitors of CHOP to regulate the unfolded protein response to ER stress
IC50<160±n/a nM
Citation PubChem, PC Dose-response primary assay and counterscreen assay for HTS small molecule inhibitors of CHOP to regulate the unfolded protein response to ER stress PubChem Bioassay(2010)[AID]
 
DNA damage-inducible transcript 3 protein
Name:DNA damage-inducible transcript 3 protein
Type:Enzyme Catalytic Domain
Mol. Mass.:19175.17
Organism:Mus musculus
Description:gi_160707929
Residue:168
BDBM61626
NameBDBM61626
Synonyms:MLS000777252 N-(4-hydroxyphenyl)-4-[(5Z)-4-keto-5-(4-methylbenzylidene)-2-thioxo-thiazolidin-3-yl]butyramide N-(4-hydroxyphenyl)-4-[(5Z)-5-[(4-methylphenyl)methylidene]-4-oxo-2-sulfanylidene-1,3-thiazolidin-3-yl]butanamide SMR000413647 | cid_1346847
TypeSmall organic molecule
Emp. Form.C21H20N2O3S2
Mol. Mass.412.525
SMILESCc1ccc(\C=C2/SC(=S)N(CCCC(=O)Nc3ccc(O)cc3)C2=O)cc1