Reaction Details
TargetDNA damage-inducible transcript 3 protein
LigandBDBM65549
Substrate/Competitorn/a
Meas. Tech.Dose-response primary assay and counterscreen assay for HTS small molecule inhibitors of CHOP to regulate the unfolded protein response to ER stress
IC50<160±n/a nM
Citation PubChem, PC Dose-response primary assay and counterscreen assay for HTS small molecule inhibitors of CHOP to regulate the unfolded protein response to ER stress PubChem Bioassay(2010)[AID]
 
DNA damage-inducible transcript 3 protein
Name:DNA damage-inducible transcript 3 protein
Type:Enzyme Catalytic Domain
Mol. Mass.:19175.17
Organism:Mus musculus
Description:gi_160707929
Residue:168
BDBM65549
NameBDBM65549
Synonyms:3-[[4-[2-(3-chloroanilino)-4-pyrimidinyl]-2-pyridinyl]amino]-1-propanol 3-[[4-[2-(3-chloroanilino)pyrimidin-4-yl]pyridin-2-yl]amino]propan-1-ol MLS000911536 cid_644215
TypeSmall organic molecule
Emp. Form.C18H18ClN5O
Mol. Mass.355.821
SMILESOCCCNc1cc(ccn1)-c1ccnc(Nc2cccc(Cl)c2)n1