Reaction Details
TargetATP-dependent molecular chaperone HSP82
LigandBDBM68261
Substrate/Competitorn/a
Meas. Tech.Malachite Green Assay
IC50 3.5e+3±n/a nM
Citation Proisy, NSharp, SYBoxall, KConnelly, SRoe, SMProdromou, CSlawin, AMPearl, LHWorkman, PMoody, CJ Inhibition of Hsp90 with synthetic macrolactones: synthesis and structural and biological evaluation of ring and conformational analogs of radicicol. Chem Biol13:1203-15 (2006) 
 
ATP-dependent molecular chaperone HSP82
Name:ATP-dependent molecular chaperone HSP82
Type:Molecular Chaperone
Mol. Mass.:81369.08
Organism:Saccharomyces cerevisiae
Description:Histidine-tagged yeast HSP90 was transformed into E. coli and purified (>90%) by metal affinity, gel filtration, and ion-exchange chromatography.
Residue:709
BDBM68261
NameBDBM68261
Synonyms:Microlactone, 15f trans
TypeSmall organic molecule
Emp. Form.C16H17ClO5
Mol. Mass.324.756
SMILESOc1cc(O)c2c(CC(=O)CCC\C=C\CCOC2=O)c1Cl