Reaction Details
TargetATP-dependent molecular chaperone HSP82
LigandBDBM68252
Substrate/Competitorn/a
Meas. Tech.FP Assay
IC50 3.23e+3±n/a nM
Citation Proisy, NSharp, SYBoxall, KConnelly, SRoe, SMProdromou, CSlawin, AMPearl, LHWorkman, PMoody, CJ Inhibition of Hsp90 with synthetic macrolactones: synthesis and structural and biological evaluation of ring and conformational analogs of radicicol. Chem Biol13:1203-15 (2006) 
 
ATP-dependent molecular chaperone HSP82
Name:ATP-dependent molecular chaperone HSP82
Type:Molecular Chaperone
Mol. Mass.:81369.08
Organism:Saccharomyces cerevisiae
Description:Histidine-tagged yeast HSP90 was transformed into E. coli and purified (>90%) by metal affinity, gel filtration, and ion-exchange chromatography.
Residue:709
BDBM68252
NameBDBM68252
Synonyms:Microlactone, 17
TypeSmall organic molecule
Emp. Form.C18H23ClO5
Mol. Mass.354.825
SMILESCC1CCCCCCCC(=O)Cc2c(Cl)c(O)cc(O)c2C(=O)O1