Reaction Details
TargetATP-dependent molecular chaperone HSP82
LigandBDBM68256
Substrate/Competitorn/a
Meas. Tech.FP Assay
IC50 1.0e+2±n/a nM
Citation Proisy, NSharp, SYBoxall, KConnelly, SRoe, SMProdromou, CSlawin, AMPearl, LHWorkman, PMoody, CJ Inhibition of Hsp90 with synthetic macrolactones: synthesis and structural and biological evaluation of ring and conformational analogs of radicicol. Chem Biol13:1203-15 (2006) 
 
ATP-dependent molecular chaperone HSP82
Name:ATP-dependent molecular chaperone HSP82
Type:Molecular Chaperone
Mol. Mass.:81369.08
Organism:Saccharomyces cerevisiae
Description:Histidine-tagged yeast HSP90 was transformed into E. coli and purified (>90%) by metal affinity, gel filtration, and ion-exchange chromatography.
Residue:709
BDBM68256
NameBDBM68256
Synonyms:Microlactone, 15c
TypeSmall organic molecule
Emp. Form.C18H21ClO5
Mol. Mass.352.809
SMILESC[C@@H]1C\C=C\CCCCC(=O)Cc2c(Cl)c(O)cc(O)c2C(=O)O1