Reaction Details
TargetBeta-hexosaminidase subunit alpha
LigandBDBM68272
Substrate/Competitorn/a
Meas. Tech.Enzyme Inhibition Assay
Temperature298.15±0 K
IC50 4.6e+3± 1.9e+3 nM
Citation Tropak, MBBlanchard, JEWithers, SGBrown, EDMahuran, D High-throughput screening for human lysosomal beta-N-Acetyl hexosaminidase inhibitors acting as pharmacological chaperones. Chem Biol14:153-64 (2007) 
 
Beta-hexosaminidase subunit alpha
Name:Beta-hexosaminidase subunit alpha
Type:Protein
Mol. Mass.:60688.46
Organism:Homo sapiens (Human)
Description:P06865
Residue:529
BDBM68272
NameBDBM68272
Synonyms:LU79953
TypeSmall organic molecule
Emp. Form.C20H25N3O2
Mol. Mass.339.4314
SMILESCCCNCCCNCCN1C(=O)c2cccc3cccc(C1=O)c23