Reaction Details
Target3-oxoacyl-[acyl-carrier-protein] synthase 3
LigandBDBM68278
Substrate/Competitorn/a
Meas. Tech.FabH Enzyme Assay
pH7±0
Temperature310.15±0 K
IC50 1.2e+3± 7e+2 nM
Citation Alhamadsheh, MMMusayev, FKomissarov, AASachdeva, SWright, HTScarsdale, NFlorova, GReynolds, KA Alkyl-CoA disulfides as inhibitors and mechanistic probes for FabH enzymes. Chem Biol14:513-24 (2007) 
 
3-oxoacyl-[acyl-carrier-protein] synthase 3
Name:3-oxoacyl-[acyl-carrier-protein] synthase 3
Type:Enzyme
Mol. Mass.:34865.07
Organism:Mycobacterium tuberculosis
Description:P9WNG2
Residue:335
BDBM68278
NameBDBM68278
Synonyms:Decyl-CoA disulfide 5
TypeSmall organic molecule
Emp. Form.C30H54N7O16P3S2
Mol. Mass.925.838
(=O)CCNC(=O)C(O)C(C)(C)OP(O)(=O)OP(O)(=O)OCC1OC(C(O)C1OP(O)(O)=O)n1cnc2c(N)ncnc12