Reaction Details
TargetMethionine aminopeptidase 1
LigandBDBM68283
Substrate/Competitorn/a
Meas. Tech.Enzymatic Assay
IC50 2.68e+4± 1.83e+4 nM
Citation Hu, XDang, YTenney, KCrews, PTsai, CWSixt, KMCole, PALiu, JO Regulation of c-Src nonreceptor tyrosine kinase activity by bengamide A through inhibition of methionine aminopeptidases. Chem Biol14:764-74 (2007) 
 
Methionine aminopeptidase 1
Name:Methionine aminopeptidase 1
Type:Enzyme
Mol. Mass.:43220.79
Organism:Homo sapiens (Human)
Description:MetAP1 with an N-terminal six histidine tag was expressed in baculovirus infected sf9 cells.
Residue:386
BDBM68283
NameBDBM68283
Synonyms:Bengamide G
TypeSmall organic molecule
Emp. Form.C30H54N2O8
Mol. Mass.570.7584
(=O)C1CCC(NC(=O)[C@H](OC)[C@H](O)[C@@H](O)[C@H](O)\C=C\C(C)C)C(=O)NC1