Reaction Details
TargetMethionine aminopeptidase 1
LigandBDBM68285
Substrate/Competitorn/a
Meas. Tech.Enzymatic Assay
IC50 5.4e+3± 2.3e+3 nM
Citation Hu, XDang, YTenney, KCrews, PTsai, CWSixt, KMCole, PALiu, JO Regulation of c-Src nonreceptor tyrosine kinase activity by bengamide A through inhibition of methionine aminopeptidases. Chem Biol14:764-74 (2007) 
 
Methionine aminopeptidase 1
Name:Methionine aminopeptidase 1
Type:Enzyme
Mol. Mass.:43220.79
Organism:Homo sapiens (Human)
Description:MetAP1 with an N-terminal six histidine tag was expressed in baculovirus infected sf9 cells.
Residue:386
BDBM68285
NameBDBM68285
Synonyms:Bengamide M
TypeSmall organic molecule
Emp. Form.C33H60N2O8
Mol. Mass.612.8381
SMILESCO[C@H]([C@H](O)[C@@H](O)[C@H](O)\C=C\C(C)C)C(=O)NC1CCC(CN(C)C1=O)C(=O)OCCCCCCCCCCCC(C)C