Reaction Details
TargetMethionine aminopeptidase 2
LigandBDBM68281
Substrate/Competitorn/a
Meas. Tech.Enzymatic Assay
IC50 1.05e+4± 3.8e+3 nM
Citation Hu, XDang, YTenney, KCrews, PTsai, CWSixt, KMCole, PALiu, JO Regulation of c-Src nonreceptor tyrosine kinase activity by bengamide A through inhibition of methionine aminopeptidases. Chem Biol14:764-74 (2007) 
 
Methionine aminopeptidase 2
Name:Methionine aminopeptidase 2
Type:Enzyme
Mol. Mass.:52884.45
Organism:Homo sapiens (Human)
Description:P50579
Residue:478
BDBM68281
NameBDBM68281
Synonyms:Bengamide A
TypeSmall organic molecule
Emp. Form.C31H56N2O8
Mol. Mass.584.7849
(=O)C1CCC(NC(=O)[C@H](OC)[C@H](O)[C@@H](O)[C@H](O)\C=C\C(C)C)C(=O)NC1