Reaction Details
TargetMethionine aminopeptidase 2
LigandBDBM68286
Substrate/Competitorn/a
Meas. Tech.Enzymatic Assay
IC50>5.0e+4±n/a nM
Citation Hu, XDang, YTenney, KCrews, PTsai, CWSixt, KMCole, PALiu, JO Regulation of c-Src nonreceptor tyrosine kinase activity by bengamide A through inhibition of methionine aminopeptidases. Chem Biol14:764-74 (2007) 
 
Methionine aminopeptidase 2
Name:Methionine aminopeptidase 2
Type:Enzyme
Mol. Mass.:52884.45
Organism:Homo sapiens (Human)
Description:P50579
Residue:478
BDBM68286
NameBDBM68286
Synonyms:Bengamide N | Bengamide O
TypeSmall organic molecule
Emp. Form.C32H58N2O8
Mol. Mass.598.8115
SMILESCO[C@H]([C@H](O)[C@@H](O)[C@H](O)\C=C\C(C)C)C(=O)NC1CCC(CN(C)C1=O)C(=O)OCCCCCCCCCCC(C)C