Reaction Details
TargetCannabinoid receptor 2
LigandBDBM68292
Substrate/Competitorn/a
Meas. Tech.SAR analysis of antagonists of the Cannabinoid Receptor 2 using an Image-Based Assay - Set 2
IC50>32000±n/a nM
Citation PubChem, PC SAR analysis of antagonists of the Cannabinoid Receptor 2 using an Image-Based Assay - Set 2 PubChem Bioassay(2010)[AID]
 
Cannabinoid receptor 2
Name:Cannabinoid receptor 2
Type:G Protein-Coupled Receptor (GPCR)
Mol. Mass.:39690.94
Organism:Homo sapiens (Human)
Description:P34972
Residue:360
BDBM68292
NameBDBM68292
Synonyms:MLS-0435525.0001 N-(2-chloro-5-morpholin-4-ylsulfonylphenyl)-4,5,6,7-tetrahydro-1-benzothiophene-2-carboxamide N-[2-chloro-5-(4-morpholinylsulfonyl)phenyl]-4,5,6,7-tetrahydro-1-benzothiophene-2-carboxamide | cid_3886815
TypeSmall organic molecule
Emp. Form.C19H21ClN2O4S2
Mol. Mass.440.964
SMILESClc1ccc(cc1NC(=O)c1cc2CCCCc2s1)S(=O)(=O)N1CCOCC1