Reaction Details
TargetG-protein coupled receptor 35
LigandBDBM68297
Substrate/Competitorn/a
Meas. Tech.SAR analysis of Agonists of the GPR35 Receptor using an Image-Based Assay - Set 3
EC50>32000±n/a nM
Citation PubChem, PC SAR analysis of Agonists of the GPR35 Receptor using an Image-Based Assay - Set 3 PubChem Bioassay(2010)[AID]
 
G-protein coupled receptor 35
Name:G-protein coupled receptor 35
Type:Enzyme Catalytic Domain
Mol. Mass.:34085.57
Organism:Homo sapiens (Human)
Description:gi_33695097
Residue:309
BDBM68297
NameBDBM68297
Synonyms:MLS-0433928.0001 [4-(2,3-dimethylphenyl)piperazin-1-yl]-(3-piperidin-1-ylsulfonylphenyl)methanone cid_2518725
TypeSmall organic molecule
Emp. Form.C24H31N3O3S
Mol. Mass.441.586
SMILESCc1cccc(N2CCN(CC2)C(=O)c2cccc(c2)S(=O)(=O)N2CCCCC2)c1C