Reaction Details
TargetCannabinoid receptor 2
LigandBDBM68293
Substrate/Competitorn/a
Meas. Tech.SAR analysis of agonists of the Cannabinoid Receptor 2 using an Image-Based Assay - Set 2
EC50>32000±n/a nM
Citation PubChem, PC SAR analysis of agonists of the Cannabinoid Receptor 2 using an Image-Based Assay - Set 2 PubChem Bioassay(2010)[AID]
 
Cannabinoid receptor 2
Name:Cannabinoid receptor 2
Type:G Protein-Coupled Receptor (GPCR)
Mol. Mass.:39690.94
Organism:Homo sapiens (Human)
Description:P34972
Residue:360
BDBM68293
NameBDBM68293
Synonyms:3-[4-(2,3-dimethylphenyl)piperazin-1-yl]carbonyl-N,N-dimethyl-benzenesulfonamide 3-[4-(2,3-dimethylphenyl)piperazine-1-carbonyl]-N,N-dimethylbenzenesulfonamide MLS-0435526.0001 | cid_2090194
TypeSmall organic molecule
Emp. Form.C21H27N3O3S
Mol. Mass.401.522
SMILESCN(C)S(=O)(=O)c1cccc(c1)C(=O)N1CCN(CC1)c1cccc(C)c1C