Reaction Details
TargetATP-dependent molecular chaperone HSP82
LigandBDBM34677
Substrate/Competitorn/a
Meas. Tech.Fluorescence Cell-Based Secondary Assay of Resistant C. albicans Growth in the Presence of Fluconazole
EC50 226.3±n/a nM
Citation PubChem, PC Fluorescence Cell-Based Secondary Assay of Resistant C. albicans Growth in the Presence of Fluconazole PubChem Bioassay(2010)[AID]
 
ATP-dependent molecular chaperone HSP82
Name:ATP-dependent molecular chaperone HSP82
Synonyms:heat shock protein 90
Type:Enzyme Catalytic Domain
Mol. Mass.:80784.12
Organism:Candida albicans
Description:gi_994798
Residue:707
BDBM34677
NameBDBM34677
TypeSmall organic molecule
Emp. Form.C20H12O4
Mol. Mass.316.3069
SMILESCc1ccc(cc1)C(=O)c1coc-2c1C(=O)C(=O)c1ccccc-21