Reaction Details
TargetATP-dependent molecular chaperone HSP82
LigandBDBM68336
Substrate/Competitorn/a
Meas. Tech.Fluorescence Cell-Based Secondary Assay of Resistant C. albicans Growth in the Presence of Fluconazole
EC50 770.9±n/a nM
Citation PubChem, PC Fluorescence Cell-Based Secondary Assay of Resistant C. albicans Growth in the Presence of Fluconazole PubChem Bioassay(2010)[AID]
 
ATP-dependent molecular chaperone HSP82
Name:ATP-dependent molecular chaperone HSP82
Synonyms:heat shock protein 90
Type:Enzyme Catalytic Domain
Mol. Mass.:80784.12
Organism:Candida albicans
Description:gi_994798
Residue:707
BDBM68336
NameBDBM68336
TypeSmall organic molecule
Emp. Form.C19H13ClN4OS2
Mol. Mass.412.916
SMILESClc1ccc(CSc2nnc(NC(=O)c3ccc4ccccc4n3)s2)cc1