Reaction Details
TargetATP-dependent molecular chaperone HSP82
LigandBDBM64596
Substrate/Competitorn/a
Meas. Tech.Fluorescence Cell-Based Secondary Assay of Resistant C. albicans Growth in the Presence of Fluconazole
EC50<100±n/a nM
Citation PubChem, PC Fluorescence Cell-Based Secondary Assay of Resistant C. albicans Growth in the Presence of Fluconazole PubChem Bioassay(2010)[AID]
 
ATP-dependent molecular chaperone HSP82
Name:ATP-dependent molecular chaperone HSP82
Synonyms:heat shock protein 90
Type:Enzyme Catalytic Domain
Mol. Mass.:80784.12
Organism:Candida albicans
Description:gi_994798
Residue:707
BDBM64596
NameBDBM64596
TypeSmall organic molecule
Emp. Form.C17H11ClN4S
Mol. Mass.338.814
SMILESClc1ccc2=NC(=NNC(c3cccs3)=c2c1)c1cccnc1