Reaction Details
TargetATP-dependent molecular chaperone HSP82
LigandBDBM58327
Substrate/Competitorn/a
Meas. Tech.Fluorescence Cell-Based Secondary Assay of Resistant C. albicans Growth in the Presence of Fluconazole
EC50 607.4±n/a nM
Citation PubChem, PC Fluorescence Cell-Based Secondary Assay of Resistant C. albicans Growth in the Presence of Fluconazole PubChem Bioassay(2010)[AID]
 
ATP-dependent molecular chaperone HSP82
Name:ATP-dependent molecular chaperone HSP82
Synonyms:heat shock protein 90
Type:Enzyme Catalytic Domain
Mol. Mass.:80784.12
Organism:Candida albicans
Description:gi_994798
Residue:707
BDBM58327
NameBDBM58327
TypeSmall organic molecule
Emp. Form.C20H19ClN2O2
Mol. Mass.354.83
SMILESCCCC(=O)NC(c1ccc(Cl)cc1)c1ccc2cccnc2c1O