Reaction Details
TargetS-ribosylhomocysteine lyase
LigandBDBM65978
Substrate/Competitorn/a
Meas. Tech.Luminescence Cell-Free Homogeneous Dose Response to Identify Inhibitors of Lux-S
EC50>350000±n/a nM
Citation PubChem, PC Luminescence Cell-Free Homogeneous Dose Response to Identify Inhibitors of Lux-S PubChem Bioassay(2010)[AID]
 
S-ribosylhomocysteine lyase
Name:S-ribosylhomocysteine lyase
Synonyms:LuxS
Type:Enzyme Catalytic Domain
Mol. Mass.:15564.06
Organism:Vibrio harveyi
Description:B0LUE4
Residue:140
BDBM65978
NameBDBM65978
TypeSmall organic molecule
Emp. Form.C17H19N3O3S2
Mol. Mass.377.481
SMILESCN(C)S(=O)(=O)c1ccc(NC(=S)NC(=O)Cc2ccccc2)cc1