Reaction Details
TargetS-ribosylhomocysteine lyase
LigandBDBM64221
Substrate/Competitorn/a
Meas. Tech.Luminescence Cell-Free Homogeneous Dose Response to Identify Inhibitors of Lux-S
EC50>350000±n/a nM
Citation PubChem, PC Luminescence Cell-Free Homogeneous Dose Response to Identify Inhibitors of Lux-S PubChem Bioassay(2010)[AID]
 
S-ribosylhomocysteine lyase
Name:S-ribosylhomocysteine lyase
Synonyms:LuxS
Type:Enzyme Catalytic Domain
Mol. Mass.:15564.06
Organism:Vibrio harveyi
Description:B0LUE4
Residue:140
BDBM64221
NameBDBM64221
TypeSmall organic molecule
Emp. Form.C25H23N3O5
Mol. Mass.445.4672
SMILESCOc1cc(NC(=O)CN2C(=O)NC(C2=O)(c2ccccc2)c2ccccc2)cc(OC)c1