Reaction Details
TargetSerine/threonine-protein phosphatase
LigandBDBM40563
Substrate/Competitorn/a
Meas. Tech.Fluorescence Cell-Based Secondary Assay to Identify Inhibitors of Calcineurin
EC50 15670±n/a nM
Citation PubChem, PC Fluorescence Cell-Based Secondary Assay to Identify Inhibitors of Calcineurin PubChem Bioassay(2010)[AID]
 
Serine/threonine-protein phosphatase
Name:Serine/threonine-protein phosphatase
Type:Enzyme Catalytic Domain
Mol. Mass.:69558.03
Organism:Candida dubliniensis CD36
Description:gi_223640082
Residue:607
BDBM40563
NameBDBM40563
Synonyms:5-bromanyl-N-(4-pyridin-2-yl-1,3-thiazol-2-yl)thiophene-2-carboxamide 5-bromo-N-[4-(2-pyridinyl)-2-thiazolyl]-2-thiophenecarboxamide MLS000564382 cid_2354167
TypeSmall organic molecule
Emp. Form.C13H8BrN3OS2
Mol. Mass.366.256
SMILESBrc1ccc(s1)C(=O)Nc1nc(cs1)-c1ccccn1