Reaction Details
TargetSerine/threonine-protein phosphatase
LigandBDBM64662
Substrate/Competitorn/a
Meas. Tech.Fluorescence Cell-Based Secondary Assay to Identify Inhibitors of Calcineurin
EC50>285000±n/a nM
Citation PubChem, PC Fluorescence Cell-Based Secondary Assay to Identify Inhibitors of Calcineurin PubChem Bioassay(2010)[AID]
 
Serine/threonine-protein phosphatase
Name:Serine/threonine-protein phosphatase
Type:Enzyme Catalytic Domain
Mol. Mass.:69558.03
Organism:Candida dubliniensis CD36
Description:gi_223640082
Residue:607
BDBM64662
NameBDBM64662
Synonyms:5-(2-methylpropoxymethyl)-8-quinolinol 5-(isobutoxymethyl)-8-quinolinol MLS000690668 cid_761896
TypeSmall organic molecule
Emp. Form.C14H17NO2
Mol. Mass.231.2903
SMILESCC(C)COCc1ccc(O)c2ncccc12