Reaction Details
TargetKrueppel-like factor 5
LigandBDBM70192
Substrate/Competitorn/a
Meas. Tech.Late stage results from the probe development effort to identify inhibitors of kruppel-like factor 5 (KLF5): luminescence-based cell-based dose response assay for inhibitors of KLF5 (Round 1)
IC50 19381±n/a nM
Citation PubChem, PC Late stage results from the probe development effort to identify inhibitors of kruppel-like factor 5 (KLF5): luminescence-based cell-based dose response assay for inhibitors of KLF5 (Round 1) PubChem Bioassay(2010)[AID]
 
Krueppel-like factor 5
Name:Krueppel-like factor 5
Type:Enzyme Catalytic Domain
Mol. Mass.:50808.71
Organism:Homo sapiens (Human)
Description:Q13887
Residue:457
BDBM70192
NameBDBM70192
Synonyms:3-[4-(4-tert-butylphenyl)-1,3-oxazol-2-yl]-N-pyridin-2-yl-propanamide 3-[4-(4-tert-butylphenyl)-2-oxazolyl]-N-(2-pyridinyl)propanamide SR-03000001157 cid_44665690
TypeSmall organic molecule
Emp. Form.C21H23N3O2
Mol. Mass.349.4262
SMILESCC(C)(C)c1ccc(cc1)-c1coc(CCC(=O)Nc2ccccn2)n1