Reaction Details
TargetKrueppel-like factor 5
LigandBDBM70196
Substrate/Competitorn/a
Meas. Tech.Late stage results from the probe development effort to identify inhibitors of kruppel-like factor 5 (KLF5): luminescence-based cell-based dose response assay for inhibitors of KLF5 (Round 1)
IC50 3184±n/a nM
Citation PubChem, PC Late stage results from the probe development effort to identify inhibitors of kruppel-like factor 5 (KLF5): luminescence-based cell-based dose response assay for inhibitors of KLF5 (Round 1) PubChem Bioassay(2010)[AID]
 
Krueppel-like factor 5
Name:Krueppel-like factor 5
Type:Enzyme Catalytic Domain
Mol. Mass.:50808.71
Organism:Homo sapiens (Human)
Description:Q13887
Residue:457
BDBM70196
NameBDBM70196
Synonyms:2,2-dimethyl-N-(2-phenyl-5-benzotriazolyl)propanamide 2,2-dimethyl-N-(2-phenylbenzotriazol-5-yl)propionamide SR-01000305891-2 | cid_2996615
TypeSmall organic molecule
Emp. Form.C17H18N4O
Mol. Mass.294.351
SMILESCC(C)(C)C(=O)Nc1ccc2nn(nc2c1)-c1ccccc1