Reaction Details
TargetKrueppel-like factor 5
LigandBDBM70197
Substrate/Competitorn/a
Meas. Tech.Late stage results from the probe development effort to identify inhibitors of kruppel-like factor 5 (KLF5): luminescence-based cell-based dose response assay for inhibitors of KLF5 (Round 1)
IC50>39841±n/a nM
Citation PubChem, PC Late stage results from the probe development effort to identify inhibitors of kruppel-like factor 5 (KLF5): luminescence-based cell-based dose response assay for inhibitors of KLF5 (Round 1) PubChem Bioassay(2010)[AID]
 
Krueppel-like factor 5
Name:Krueppel-like factor 5
Type:Enzyme Catalytic Domain
Mol. Mass.:50808.71
Organism:Homo sapiens (Human)
Description:Q13887
Residue:457
BDBM70197
NameBDBM70197
Synonyms:N-[2-(3-chlorophenyl)-5-benzotriazolyl]-2-phenoxyacetamide N-[2-(3-chlorophenyl)benzotriazol-5-yl]-2-phenoxy-ethanamide SR-01000419352 cid_1112727
TypeSmall organic molecule
Emp. Form.C20H15ClN4O2
Mol. Mass.378.812
SMILESClc1cccc(c1)-n1nc2ccc(NC(=O)COc3ccccc3)cc2n1