Reaction Details
TargetKrueppel-like factor 5
LigandBDBM70200
Substrate/Competitorn/a
Meas. Tech.Late stage results from the probe development effort to identify inhibitors of kruppel-like factor 5 (KLF5): luminescence-based cell-based dose response assay for inhibitors of KLF5 (Round 1)
IC50>39841±n/a nM
Citation PubChem, PC Late stage results from the probe development effort to identify inhibitors of kruppel-like factor 5 (KLF5): luminescence-based cell-based dose response assay for inhibitors of KLF5 (Round 1) PubChem Bioassay(2010)[AID]
 
Krueppel-like factor 5
Name:Krueppel-like factor 5
Type:Enzyme Catalytic Domain
Mol. Mass.:50808.71
Organism:Homo sapiens (Human)
Description:Q13887
Residue:457
BDBM70200
NameBDBM70200
Synonyms:N-[2-(4-methoxyphenyl)-5-benzotriazolyl]-2,2-dimethylpropanamide N-[2-(4-methoxyphenyl)benzotriazol-5-yl]-2,2-dimethyl-propionamide SR-03000001316 cid_17027238
TypeSmall organic molecule
Emp. Form.C18H20N4O2
Mol. Mass.324.377
SMILESCOc1ccc(cc1)-n1nc2ccc(NC(=O)C(C)(C)C)cc2n1