Reaction Details
TargetKrueppel-like factor 5
LigandBDBM70213
Substrate/Competitorn/a
Meas. Tech.Late stage results from the probe development effort to identify inhibitors of kruppel-like factor 5 (KLF5): luminescence-based cell-based dose response assay for inhibitors of KLF5 (Round 1)
IC50 805.65±n/a nM
Citation PubChem, PC Late stage results from the probe development effort to identify inhibitors of kruppel-like factor 5 (KLF5): luminescence-based cell-based dose response assay for inhibitors of KLF5 (Round 1) PubChem Bioassay(2010)[AID]
 
Krueppel-like factor 5
Name:Krueppel-like factor 5
Type:Enzyme Catalytic Domain
Mol. Mass.:50808.71
Organism:Homo sapiens (Human)
Description:Q13887
Residue:457
BDBM70213
NameBDBM70213
Synonyms:4-[3-(4-tert-butylphenyl)-1,2,4-oxadiazol-5-yl]-N-(2-chlorophenyl)butanamide SR-03000001330 cid_2982276
TypeSmall organic molecule
Emp. Form.C22H24ClN3O2
Mol. Mass.397.898
SMILESCC(C)(C)c1ccc(cc1)-c1noc(CCCC(=O)Nc2ccccc2Cl)n1