Reaction Details
TargetKrueppel-like factor 5
LigandBDBM70223
Substrate/Competitorn/a
Meas. Tech.Late stage results from the probe development effort to identify inhibitors of kruppel-like factor 5 (KLF5): luminescence-based cell-based dose response assay for inhibitors of KLF5 (Round 1)
IC50 42616±n/a nM
Citation PubChem, PC Late stage results from the probe development effort to identify inhibitors of kruppel-like factor 5 (KLF5): luminescence-based cell-based dose response assay for inhibitors of KLF5 (Round 1) PubChem Bioassay(2010)[AID]
 
Krueppel-like factor 5
Name:Krueppel-like factor 5
Type:Enzyme Catalytic Domain
Mol. Mass.:50808.71
Organism:Homo sapiens (Human)
Description:Q13887
Residue:457
BDBM70223
NameBDBM70223
Synonyms:N-(6-chloranyl-2-phenyl-benzotriazol-5-yl)cyclopropanecarboxamide N-(6-chloro-2-phenyl-benzotriazol-5-yl)cyclopropanecarboxamide SR-03000001353 cid_45281180
TypeSmall organic molecule
Emp. Form.C16H13ClN4O
Mol. Mass.312.754
SMILESClc1cc2nn(nc2cc1NC(=O)C1CC1)-c1ccccc1