Reaction Details
TargetKrueppel-like factor 5
LigandBDBM70224
Substrate/Competitorn/a
Meas. Tech.Late stage results from the probe development effort to identify inhibitors of kruppel-like factor 5 (KLF5): luminescence-based cell-based dose response assay for inhibitors of KLF5 (Round 1)
IC50>39841±n/a nM
Citation PubChem, PC Late stage results from the probe development effort to identify inhibitors of kruppel-like factor 5 (KLF5): luminescence-based cell-based dose response assay for inhibitors of KLF5 (Round 1) PubChem Bioassay(2010)[AID]
 
Krueppel-like factor 5
Name:Krueppel-like factor 5
Type:Enzyme Catalytic Domain
Mol. Mass.:50808.71
Organism:Homo sapiens (Human)
Description:Q13887
Residue:457
BDBM70224
NameBDBM70224
Synonyms:N-(6-chloranyl-2-phenyl-benzotriazol-5-yl)-3,4-dihydro-2H-chromene-3-carboxamide N-(6-chloro-2-phenyl-benzotriazol-5-yl)chroman-3-carboxamide SR-03000001355 cid_45281184
TypeSmall organic molecule
Emp. Form.C22H17ClN4O2
Mol. Mass.404.849
SMILESClc1cc2nn(nc2cc1NC(=O)C1COc2ccccc2C1)-c1ccccc1