Reaction Details
TargetProtein RecA
LigandBDBM31773
Substrate/Competitorn/a
Meas. Tech.Fluorescence Cell-Free Homogeneous Dose Retest to Identify Inhibitors of RecA-Intein Splicing Activity
EC50 10200±n/a nM
Citation PubChem, PC Fluorescence Cell-Free Homogeneous Dose Retest to Identify Inhibitors of RecA-Intein Splicing Activity PubChem Bioassay(2010)[AID]
 
Protein RecA
Name:Protein RecA
Type:Enzyme Catalytic Domain
Mol. Mass.:85386.52
Organism:Mycobacterium tuberculosis H37Rv
Description:gi_15609874
Residue:790
BDBM31773
NameBDBM31773
Synonyms:ECONAZOLE Gyno-pevaryl cid_68589
TypeSmall organic molecule
Emp. Form.C18H15Cl3N2O
Mol. Mass.381.684
SMILESClc1ccc(COC(Cn2ccnc2)c2ccc(Cl)cc2Cl)cc1