Reaction Details
TargetProtein RecA
LigandBDBM31770
Substrate/Competitorn/a
Meas. Tech.Fluorescence Cell-Free Homogeneous Dose Retest to Identify Inhibitors of RecA-Intein Splicing Activity
EC50 9780±n/a nM
Citation PubChem, PC Fluorescence Cell-Free Homogeneous Dose Retest to Identify Inhibitors of RecA-Intein Splicing Activity PubChem Bioassay(2010)[AID]
 
Protein RecA
Name:Protein RecA
Type:Enzyme Catalytic Domain
Mol. Mass.:85386.52
Organism:Mycobacterium tuberculosis H37Rv
Description:gi_15609874
Residue:790
BDBM31770
NameBDBM31770
Synonyms:Exelderm cid_65495 | sulconazole
TypeSmall organic molecule
Emp. Form.C18H15Cl3N2S
Mol. Mass.397.749
SMILESClc1ccc(CSC(Cn2ccnc2)c2ccc(Cl)cc2Cl)cc1