Reaction Details
TargetProtein RecA
LigandBDBM60403
Substrate/Competitorn/a
Meas. Tech.Fluorescence Cell-Free Homogeneous Dose Retest to Identify Inhibitors of RecA-Intein Splicing Activity
EC50 1100±n/a nM
Citation PubChem, PC Fluorescence Cell-Free Homogeneous Dose Retest to Identify Inhibitors of RecA-Intein Splicing Activity PubChem Bioassay(2010)[AID]
 
Protein RecA
Name:Protein RecA
Type:Enzyme Catalytic Domain
Mol. Mass.:85386.52
Organism:Mycobacterium tuberculosis H37Rv
Description:gi_15609874
Residue:790
BDBM60403
NameBDBM60403
Synonyms:1-phenyl-4-pyrazolol MLS000104392 cid_555359
TypeSmall organic molecule
Emp. Form.C9H8N2O
Mol. Mass.160.1726
SMILESOc1cnn(c1)-c1ccccc1