Reaction Details
TargetProtein LANA1
LigandBDBM50094569
Substrate/Competitorn/a
Meas. Tech.Fluorescence Polarization Cell-Free Homogeneous Dose Retest to Confirm Inhibitors of the LANA Histone H2A/H2B Interaction
EC50>75000±n/a nM
Citation PubChem, PC Fluorescence Polarization Cell-Free Homogeneous Dose Retest to Confirm Inhibitors of the LANA Histone H2A/H2B Interaction PubChem Bioassay(2010)[AID]
 
Protein LANA1
Name:Protein LANA1
Type:Enzyme Catalytic Domain
Mol. Mass.:131093.36
Organism:Human herpesvirus 8
Description:Q9QR71
Residue:1129
BDBM50094569
NameBDBM50094569
Synonyms:6-chloro-3,20-dioxo-1beta,2beta-dihydro-3'H-cyclopropa[1,2]pregna-4,6-dien-17-yl acetate Cyproterone 17-O-acetate cyproterone acetate
TypeSmall organic molecule
Emp. Form.C24H29ClO4
Mol. Mass.416.938
SMILESCC(=O)O[C@@]1(CC[C@H]2[C@@H]3C=C(Cl)C4=CC(=O)[C@@H]5C[C@@H]5[C@]4(C)[C@H]3CC[C@]12C)C(C)=O