Reaction Details
TargetProtein LANA1
LigandBDBM74282
Substrate/Competitorn/a
Meas. Tech.Fluorescence Polarization Cell-Free Homogeneous Dose Retest to Confirm Inhibitors of the LANA Histone H2A/H2B Interaction
EC50>75000±n/a nM
Citation PubChem, PC Fluorescence Polarization Cell-Free Homogeneous Dose Retest to Confirm Inhibitors of the LANA Histone H2A/H2B Interaction PubChem Bioassay(2010)[AID]
 
Protein LANA1
Name:Protein LANA1
Type:Enzyme Catalytic Domain
Mol. Mass.:131093.36
Organism:Human herpesvirus 8
Description:Q9QR71
Residue:1129
BDBM74282
NameBDBM74282
Synonyms:MLS002182844 N-[2-(dimethylamino)-2-phenyl-ethyl]-2-methyl-5-[(3-methylphenyl)sulfamoyl]benzamide SMR001271874 | cid_25161888
TypeSmall organic molecule
Emp. Form.C25H29N3O3S
Mol. Mass.451.581
SMILESCN(C)C(CNC(=O)c1cc(ccc1C)S(=O)(=O)Nc1cccc(C)c1)c1ccccc1