Reaction Details
TargetProtein LANA1
LigandBDBM74290
Substrate/Competitorn/a
Meas. Tech.Fluorescence Polarization Cell-Free Homogeneous Dose Retest to Confirm Inhibitors of the LANA Histone H2A/H2B Interaction
EC50>75000±n/a nM
Citation PubChem, PC Fluorescence Polarization Cell-Free Homogeneous Dose Retest to Confirm Inhibitors of the LANA Histone H2A/H2B Interaction PubChem Bioassay(2010)[AID]
 
Protein LANA1
Name:Protein LANA1
Type:Enzyme Catalytic Domain
Mol. Mass.:131093.36
Organism:Human herpesvirus 8
Description:Q9QR71
Residue:1129
BDBM74290
NameBDBM74290
Synonyms:MLS002181711 N-[2-(2,6-dimethylanilino)-2-oxoethyl]-N-methyl-9-oxo-2,3-dihydro-1H-pyrrolo[2,1-b]quinazoline-6-carboxamide SMR001270741 | cid_25162195
TypeSmall organic molecule
Emp. Form.C23H24N4O3
Mol. Mass.404.4617
SMILESCN(CC(=O)Nc1c(C)cccc1C)C(=O)c1ccc2c(c1)nc1CCCn1c2=O