Reaction Details
TargetProtein LANA1
LigandBDBM74295
Substrate/Competitorn/a
Meas. Tech.Fluorescence Polarization Cell-Free Homogeneous Dose Retest to Confirm Inhibitors of the LANA Histone H2A/H2B Interaction
EC50>75000±n/a nM
Citation PubChem, PC Fluorescence Polarization Cell-Free Homogeneous Dose Retest to Confirm Inhibitors of the LANA Histone H2A/H2B Interaction PubChem Bioassay(2010)[AID]
 
Protein LANA1
Name:Protein LANA1
Type:Enzyme Catalytic Domain
Mol. Mass.:131093.36
Organism:Human herpesvirus 8
Description:Q9QR71
Residue:1129
BDBM74295
NameBDBM74295
Synonyms:MLS002180901 N-[6-amino-1-(2-methylpropyl)-2,4-dioxo-5-pyrimidinyl]-4-(1,3-benzothiazol-2-yl)-N-butylbutanamide N-[6-azanyl-1-(2-methylpropyl)-2,4-bis(oxidanylidene)pyrimidin-5-yl]-4-(1,3-benzothiazol-2-yl)-N-butyl-butanamide cid_25162304
TypeSmall organic molecule
Emp. Form.C23H31N5O3S
Mol. Mass.457.589
SMILESCCCCN(C(=O)CCCc1nc2ccccc2s1)c1c(N)n(CC(C)C)c(=O)[nH]c1=O