Reaction Details
TargetProtein LANA1
LigandBDBM74297
Substrate/Competitorn/a
Meas. Tech.Fluorescence Polarization Cell-Free Homogeneous Dose Retest to Confirm Inhibitors of the LANA Histone H2A/H2B Interaction
EC50>75000±n/a nM
Citation PubChem, PC Fluorescence Polarization Cell-Free Homogeneous Dose Retest to Confirm Inhibitors of the LANA Histone H2A/H2B Interaction PubChem Bioassay(2010)[AID]
 
Protein LANA1
Name:Protein LANA1
Type:Enzyme Catalytic Domain
Mol. Mass.:131093.36
Organism:Human herpesvirus 8
Description:Q9QR71
Residue:1129
BDBM74297
NameBDBM74297
Synonyms:3-(2,5-dimethylphenoxy)propanoic acid [2-(2,2-dimethyl-3-oxo-4H-quinoxalin-1-yl)-2-oxoethyl] ester MLS002180886 [2-(2,2-dimethyl-3-oxidanylidene-4H-quinoxalin-1-yl)-2-oxidanylidene-ethyl] 3-(2,5-dimethylphenoxy)propanoate cid_7856485
TypeSmall organic molecule
Emp. Form.C23H26N2O5
Mol. Mass.410.4629
SMILESCc1ccc(C)c(OCCC(=O)OCC(=O)N2c3ccccc3NC(=O)C2(C)C)c1