Reaction Details
TargetProtein LANA1
LigandBDBM74302
Substrate/Competitorn/a
Meas. Tech.Fluorescence Polarization Cell-Free Homogeneous Dose Retest to Confirm Inhibitors of the LANA Histone H2A/H2B Interaction
EC50>75000±n/a nM
Citation PubChem, PC Fluorescence Polarization Cell-Free Homogeneous Dose Retest to Confirm Inhibitors of the LANA Histone H2A/H2B Interaction PubChem Bioassay(2010)[AID]
 
Protein LANA1
Name:Protein LANA1
Type:Enzyme Catalytic Domain
Mol. Mass.:131093.36
Organism:Human herpesvirus 8
Description:Q9QR71
Residue:1129
BDBM74302
NameBDBM74302
Synonyms:3-[(4-fluorophenyl)sulfamoyl]-N-[(1-piperidin-1-ylcyclohexyl)methyl]benzamide 3-[(4-fluorophenyl)sulfamoyl]-N-[[1-(1-piperidinyl)cyclohexyl]methyl]benzamide SMR001271384 | cid_25162665
TypeSmall organic molecule
Emp. Form.C25H32FN3O3S
Mol. Mass.473.603
SMILESFc1ccc(NS(=O)(=O)c2cccc(c2)C(=O)NCC2(CCCCC2)N2CCCCC2)cc1