Reaction Details
TargetProtein LANA1
LigandBDBM74309
Substrate/Competitorn/a
Meas. Tech.Fluorescence Polarization Cell-Free Homogeneous Dose Retest to Confirm Inhibitors of the LANA Histone H2A/H2B Interaction
EC50>75000±n/a nM
Citation PubChem, PC Fluorescence Polarization Cell-Free Homogeneous Dose Retest to Confirm Inhibitors of the LANA Histone H2A/H2B Interaction PubChem Bioassay(2010)[AID]
 
Protein LANA1
Name:Protein LANA1
Type:Enzyme Catalytic Domain
Mol. Mass.:131093.36
Organism:Human herpesvirus 8
Description:Q9QR71
Residue:1129
BDBM74309
NameBDBM74309
Synonyms:3-chloranyl-N-[2-[(3-methoxyphenyl)amino]-2-oxidanylidene-ethyl]-N-methyl-adamantane-1-carboxamide 3-chloro-N-[2-(3-methoxyanilino)-2-oxoethyl]-N-methyladamantane-1-carboxamide MLS002180775 cid_25162783
TypeSmall organic molecule
Emp. Form.C21H27ClN2O3
Mol. Mass.390.904
SMILES[H]C12CC3([H])CC(Cl)(C1)CC(C2)(C3)C(=O)N(C)CC(=O)Nc1cccc(OC)c1