Reaction Details
TargetProtein LANA1
LigandBDBM74316
Substrate/Competitorn/a
Meas. Tech.Fluorescence Polarization Cell-Free Homogeneous Dose Retest to Confirm Inhibitors of the LANA Histone H2A/H2B Interaction
EC50>75000±n/a nM
Citation PubChem, PC Fluorescence Polarization Cell-Free Homogeneous Dose Retest to Confirm Inhibitors of the LANA Histone H2A/H2B Interaction PubChem Bioassay(2010)[AID]
 
Protein LANA1
Name:Protein LANA1
Type:Enzyme Catalytic Domain
Mol. Mass.:131093.36
Organism:Human herpesvirus 8
Description:Q9QR71
Residue:1129
BDBM74316
NameBDBM74316
Synonyms:2-fluoro-5-(4-morpholinylsulfonyl)benzoic acid [1-(cyclopentylamino)-1-oxopropan-2-yl] ester MLS002161581 [1-(cyclopentylamino)-1-oxidanylidene-propan-2-yl] 2-fluoranyl-5-morpholin-4-ylsulfonyl-benzoate cid_4323391
TypeSmall organic molecule
Emp. Form.C19H25FN2O6S
Mol. Mass.428.475
SMILESCC(OC(=O)c1cc(ccc1F)S(=O)(=O)N1CCOCC1)C(=O)NC1CCCC1