Reaction Details
TargetTyrosine-protein phosphatase non-receptor type 22
LigandBDBM74444
Substrate/Competitorn/a
Meas. Tech.Dose Response confirmation of uHTS hits from a small molecule inhibitors of LYP via a fluorescence intensity assay - Set 2
IC50>79400±0 nM
Citation PubChem, PC Dose Response confirmation of uHTS hits from a small molecule inhibitors of LYP via a fluorescence intensity assay - Set 2 PubChem Bioassay(2010)[AID]
 
Tyrosine-protein phosphatase non-receptor type 22
Name:Tyrosine-protein phosphatase non-receptor type 22
Type:n/a
Mol. Mass.:91712.31
Organism:Homo sapiens (Human)
Description:Q9Y2R2
Residue:807
BDBM74444
NameBDBM74444
Synonyms:4-Isopropyl-4H-furo[3,2-b]pyrrole-5-carboxylic acid [(benzo[1,3]dioxol-5-ylmethyl)-carbamoyl]-methyl ester 4-propan-2-yl-5-furo[3,2-b]pyrrolecarboxylic acid [2-(1,3-benzodioxol-5-ylmethylamino)-2-oxoethyl] ester SMR000008063 [2-(1,3-benzodioxol-5-ylmethylamino)-2-oxoethyl] 4-propan-2-ylfuro[3,2-b]pyrrole-5-carboxylate | cid_648085
TypeSmall organic molecule
Emp. Form.C20H20N2O6
Mol. Mass.384.3826
SMILESCC(C)n1c(cc2occc12)C(=O)OCC(=O)NCc1ccc2OCOc2c1