Reaction Details
TargetTyrosine-protein phosphatase non-receptor type 22
LigandBDBM32102
Substrate/Competitorn/a
Meas. Tech.Dose Response confirmation of uHTS hits from a small molecule inhibitors of LYP via a fluorescence intensity assay - Set 2
IC50<1240±0 nM
Citation PubChem, PC Dose Response confirmation of uHTS hits from a small molecule inhibitors of LYP via a fluorescence intensity assay - Set 2 PubChem Bioassay(2010)[AID]
 
Tyrosine-protein phosphatase non-receptor type 22
Name:Tyrosine-protein phosphatase non-receptor type 22
Type:n/a
Mol. Mass.:91712.31
Organism:Homo sapiens (Human)
Description:Q9Y2R2
Residue:807
BDBM32102
NameBDBM32102
Synonyms:1,6-dimethylpyrimido[5,4-e][1,2,4]triazine-5,7(1H,6H)-dione 1,6-dimethylpyrimido[5,4-e][1,2,4]triazine-5,7-quinone SMR000024051 US9738628, Compound PKF118-310 | cid_66541
TypeSmall organic molecule
Emp. Form.C7H7N5O2
Mol. Mass.193.1628
SMILESCn1ncnc2c1nc(=O)n(C)c2=O