Reaction Details
TargetTyrosine-protein phosphatase non-receptor type 22
LigandBDBM74456
Substrate/Competitorn/a
Meas. Tech.Dose Response confirmation of uHTS hits from a small molecule inhibitors of LYP via a fluorescence intensity assay - Set 2
IC50>79400±0 nM
Citation PubChem, PC Dose Response confirmation of uHTS hits from a small molecule inhibitors of LYP via a fluorescence intensity assay - Set 2 PubChem Bioassay(2010)[AID]
 
Tyrosine-protein phosphatase non-receptor type 22
Name:Tyrosine-protein phosphatase non-receptor type 22
Type:n/a
Mol. Mass.:91712.31
Organism:Homo sapiens (Human)
Description:Q9Y2R2
Residue:807
BDBM74456
NameBDBM74456
Synonyms:5-methyl-N-[3-(2-oxidanylidenepyrrolidin-1-yl)propyl]thiophene-3-carboxamide 5-methyl-N-[3-(2-oxopyrrolidin-1-yl)propyl]thiophene-3-carboxamide N-[3-(2-ketopyrrolidino)propyl]-5-methyl-thiophene-3-carboxamide cid_2225281
TypeSmall organic molecule
Emp. Form.C13H18N2O2S
Mol. Mass.266.359
SMILESCc1cc(cs1)C(=O)NCCCN1CCCC1=O