Reaction Details
TargetTyrosine-protein phosphatase non-receptor type 22
LigandBDBM54768
Substrate/Competitorn/a
Meas. Tech.Dose Response confirmation of uHTS hits from a small molecule inhibitors of LYP via a fluorescence intensity assay - Set 2
IC50 4076±259 nM
Citation PubChem, PC Dose Response confirmation of uHTS hits from a small molecule inhibitors of LYP via a fluorescence intensity assay - Set 2 PubChem Bioassay(2010)[AID]
 
Tyrosine-protein phosphatase non-receptor type 22
Name:Tyrosine-protein phosphatase non-receptor type 22
Type:n/a
Mol. Mass.:91712.31
Organism:Homo sapiens (Human)
Description:Q9Y2R2
Residue:807
BDBM54768
NameBDBM54768
Synonyms:2-[3-[2-hydroxyethyl(dimethyl)ammonio]propanoylamino]-2-methyl-propane-1-sulfonate 2-[3-[2-hydroxyethyl(dimethyl)azaniumyl]propanoylamino]-2-methylpropane-1-sulfonate MLS000554255 US20230364057, Compound 42 | cid_1973720
TypeSmall organic molecule
Emp. Form.C11H24N2O5S
Mol. Mass.296.384
SMILESCC(C)(CS([O-])(=O)=O)NC(=O)CC[N+](C)(C)CCO