Reaction Details
TargetTyrosine-protein phosphatase non-receptor type 22
LigandBDBM51141
Substrate/Competitorn/a
Meas. Tech.Dose Response confirmation of uHTS hits from a small molecule inhibitors of LYP via a fluorescence intensity assay - Set 2
IC50<1240±0 nM
Citation PubChem, PC Dose Response confirmation of uHTS hits from a small molecule inhibitors of LYP via a fluorescence intensity assay - Set 2 PubChem Bioassay(2010)[AID]
 
Tyrosine-protein phosphatase non-receptor type 22
Name:Tyrosine-protein phosphatase non-receptor type 22
Type:n/a
Mol. Mass.:91712.31
Organism:Homo sapiens (Human)
Description:Q9Y2R2
Residue:807
BDBM51141
NameBDBM51141
Synonyms:2-[4-[(Z)-[3-[2-(1H-indol-3-yl)ethyl]-2-(4-methoxyphenyl)imino-4-oxidanylidene-1,3-thiazolidin-5-ylidene]methyl]phenoxy]ethanoic acid 2-[4-[(Z)-[3-[2-(1H-indol-3-yl)ethyl]-2-(4-methoxyphenyl)imino-4-oxo-5-thiazolidinylidene]methyl]phenoxy]acetic acid MLS000704894 [4-({3-[2-(1H-indol-3-yl)ethyl]-2-[(4-methoxyphenyl)imino]-4-oxo-1,3-thiazolidin-5-ylidene}methyl)phenoxy]acetic acid | cid_5995173
TypeSmall organic molecule
Emp. Form.C29H25N3O5S
Mol. Mass.527.591
SMILESCOc1ccc(cc1)\N=C1/S\C(=C/c2ccc(OCC(O)=O)cc2)C(=O)N1CCc1c[nH]c2ccccc12